{"text_format":"1","workbook":"xlsx","n_sheets":3,"sheets":["Standard","Volumi","Superfici"],"not_rendered":{"charts":0,"images":1,"macros":1,"external_links":0,"defined_names":2,"comments":3,"pivot_tables":0},"unopened":[],"bounds":{"document_bytes":16777216,"sheet_cells":100000,"rows_first":2000,"rows_last":500,"rows_between":2000,"halvings":0,"cell_chars":16384,"cell_head_chars":4096},"cells_cut":0,"cells_raw":0,"read":"whole","date_system":"1900"}

{"sheet":"Standard","index":0,"n_rows":89,"n_cols":26,"rows_kept":89,"cut":false,"hidden":false,"merged":[[5,13,5,16],[8,4,9,5],[28,22,29,23]]}
[null,null,null,"Piano di Lottizzazione zone «C» "]
[]
[]
[null,null,null,null,null,null,null,null,"Indice Territoriale, it =",0.9,"m3/m2"]
[]
[null,null,null,null,null,null,null,null,"Superficie territoriale, St =",35000,"m2",null,"Comune ","Classe II - Comuni da 10.000 a 20.000 abitanti;"]
[]
[null,null,null,null,null,null,null,null," VReep = ",0.4]
[]
[]
[null,null,null,null,null,null,null,null,null,null,null,null,null,null,null,{"$f":"CONCATENATE(\"VReep = \", FIXED(J8),\" ∙ VR = \",FIXED(J8),\" x \",FIXED(K12),\" =\")","v":"VReep = 0.40 ∙ VR = 0.40 x 22,050.00 ="},{"$f":"ROUND(J8*K12,2)","v":8820},"m3",null,"→"]
[null,null,null,null,null,null,null,null,null,{"$f":" CONCATENATE(\"VR = 70% ∙ V = 70% x \",E15,\" =\")","v":"VR = 70% ∙ V = 70% x 31500 ="},{"$f":"E15*0.7","v":22050},"m3"]
[null,null,null,null,null,null,null,null,null,null,null,null,null,null,null,{"$f":"CONCATENATE(\"VRlib = (1-\", J8,\")∙VR = (1-\",J8,\") x \",K12,\" =\")","v":"VRlib = (1-0.4)∙VR = (1-0.4) x 22050 ="},{"$f":"K12*(1-J8)","v":13230},"m3",null,"→",null,null,null,5]
[null,null,null,null,null,null,null,null,null,null,null,null,null,null,null,null,null,null,null,null,null,10530]
[null,null,null,{"$f":"CONCATENATE(\"V = St∙it =\",J6,\" x \",J4,\" =\")","v":"V = St∙it =35000 x 0.9 ="},{"$f":"J6*J4","v":31500},"m3",null,null,null,{"$f":" CONCATENATE(\"VS = 20% ∙ V = 20% x \",E15,\" =\")","v":"VS = 20% ∙ V = 20% x 31500 ="},{"$f":"E15*0.2","v":6300},"m3",null,null,null,null,null,null,null,null,null,21912]
[null,null,null,null,null,null,null,null,null,null,null,null,null,null,null,null,null,null,null,null,null,5228]
[null,null,null,null,null,null,null,null,null,null,null,null,null,null,null,null,null,null,null,null,null,{"$f":"SUM(V14:V16)","v":37670}]
[null,null,null,null,null,null,null,null,null,{"$f":" CONCATENATE(\"VSp = 10% ∙ V = 10% x \",E15,\" =\")","v":"VSp = 10% ∙ V = 10% x 31500 ="},{"$f":"E15*0.1","v":3150},"m3",null,null,null,"∙",null,null,null,null,null,5380]
[null,null,null,null,null,null,null,null,null,null,null,null,null,null,null,null,null,null,null,null,null,2199]
[null,null,null,null,null,null,null,null,null,null,null,null,null,null,null,{"$f":"CONCATENATE(\"S1 = \",FIXED(J79),\" ∙ n°ab = \",FIXED(J79),\" x \",FIXED(F22,0),\" =\")","v":"S1 = 4.50 ∙ n°ab = 4.50 x 315 ="},{"$f":"J79*F22","v":1417.5},"m²",null,null,null,{"$f":"SUM(V14:V19)","v":82919}]
[null,null,null,null,null,null,null,null,null,null,null,null,null,null,null,{"$f":"CONCATENATE(\"S2 = \",FIXED(K79),\" ∙ n°ab = \",FIXED(K79),\" x \",FIXED(F22),\" =\")","v":"S2 = 2.00 ∙ n°ab = 2.00 x 315.00 ="},{"$f":"K79*F22","v":630},"m²",null,null,null,{"$f":"J6-V20","v":-47919}]
[null,null,null,null,{"$f":"CONCATENATE(\" n° ab = V/100 = \",FIXED(E15),\" / 100 =\")","v":" n° ab = V/100 = 31,500.00 / 100 ="},{"$f":"ROUND(E15/100,0)","v":315},null,null,null,{"$f":"CONCATENATE(\"S =\",FIXED(I79,0),\"m²/ab ∙ n°ab =\",FIXED(I79,0),\" x \",F22,\" =\")","v":"S =18m²/ab ∙ n°ab =18 x 315 ="},{"$f":"I79*F22","v":5670},"m2",null,null,null,{"$f":"CONCATENATE(\"S3 = \",FIXED(L79),\" ∙ n°ab = \",FIXED(L79),\" x \",FIXED(F22),\" =\")","v":"S3 = 9.00 ∙ n°ab = 9.00 x 315.00 ="},{"$f":"L79*F22","v":2835},"m²"]
[null,null,null,null,null,null,null,null,null,null,null,null,null,null,null,{"$f":"CONCATENATE(\"S4 = \",FIXED(M79),\" ∙ n°ab = \",FIXED(M79),\" x \",FIXED(F22),\" =\")","v":"S4 = 2.50 ∙ n°ab = 2.50 x 315.00 ="},{"$f":"M79*F22","v":787.5},"m²"]
[]
[null,null,null,null,null,null,null,null,null,null,null,null,null,null,null,{"$f":"CONCATENATE(\"Superfici  Viabilità → Sv = \",FIXED(I81),\"%∙ St = \",FIXED(I81),\"% x \",FIXED(J6),\" = \")","v":"Superfici  Viabilità → Sv = 15.00%∙ St = 15.00% x 35,000.00 = "},{"$f":"J6*I81/100","v":5250},"m²"]
[]
[null,null,null,null,null,null,null,null,null,null,null,null,null,null,null,{"$f":"CONCATENATE(\"Superficie fondiaria edilizia residenziale → Sf = St - (S1+S2+S3+S4+Sv) = \",FIXED(J6),\"-(\",FIXED(Q20),\"+\",FIXED(Q21),\"+\",FIXED(Q22),\"+\",FIXED(Q23),\"+\",FIXED(Q23),\") = \")","v":"Superficie fondiaria edilizia residenziale → Sf = St - (S1+S2+S3+S4+Sv) = 35,000.00-(1,417.50+630.00+2,835.00+787.50+787.50) = "},{"$f":"J6-SUM(Q20:Q25)","v":24080},"m²"]
[]
[null,null,null,null,null,null,null,null,null,null,null,null,null,null,null,{"$f":"CONCATENATE(\"indice fonfiario → if = VR/Sf = \",FIXED(K12),\"/\",FIXED(Q27),\" = \")","v":"indice fonfiario → if = VR/Sf = 22,050.00/24,080.00 = "},{"$f":"K12/Q27","v":0.91569767441860461},"m³/m²",null,null,null,null,"n° piani",null,"H","SAL"]
[null,null,null,null,null,null,null,null,null,null,null,null,null,null,null,null,null,null,null,null,null,null,null,null,"m","m²"]
[null,null,null,null,null,null,null,null,null,null,null,null,null,null,null,{"$f":"CONCATENATE(\"1. Case in Linea → Sf₁ = Vreep / if = \",FIXED(Q11),\" / \",FIXED(Q29),\" = \")","v":"1. Case in Linea → Sf₁ = Vreep / if = 8,820.00 / 0.92 = "},{"$f":"Q11/Q29","v":9632},"m²",null,null,null,null,null,5,{"$f":"2.7+3*(X31-1)","v":14.7},{"$f":"Q11/Y31","v":600}]
[null,null,null,null,"Tipologie Edilizie Residenziali",null,null,null,null,null,null,null,null,null,null,{"$f":"CONCATENATE(\"2. Case a schiera → Sf₂ = (VRlib∙\",FIXED(I82),\"%)/if = (\",FIXED(Q13),\"x\",FIXED(I82),\"% ) / \",FIXED(Q29),\" = \")","v":"2. Case a schiera → Sf₂ = (VRlib∙43.00%)/if = (13,230.00x43.00% ) / 0.92 = "},{"$f":"Q13*I82/100/Q29","v":6212.6399999999994},"m²",null,null,null,null,null,2,{"$f":"2.7+3*(X32-1)","v":5.7},{"$f":"Q12/Y32","v":0}]
[null,null,null,null,null,null,null,null,null,null,null,null,null,null,null,{"$f":"CONCATENATE(\"3. Case Unifamiliari isolate → Sf₃ = (VReep∙\",,FIXED(I83),\"% )/if = (\",FIXED(Q13),\"x\",FIXED(I83),\"%) / \",FIXED(Q29),\" = \")","v":"3. Case Unifamiliari isolate → Sf₃ = (VReep∙57.00% )/if = (13,230.00x57.00%) / 0.92 = "},{"$f":"Q13*I83/100/Q29","v":8235.36},"m²"]
[]
[null,null,null,null,null,null,null,null,null,null,null,"Art. 41-sexies L.1150/1942 → parcheggi pertinenziali  1m²/10³ →",null,null,null,{"$f":"CONCATENATE( \"Sp = V / 10 = \",E15,\" / 10 =\")","v":"Sp = V / 10 = 31500 / 10 ="},{"$f":"E15/10","v":3150},"m2"]
[]
[null,null,null,null,null,null,null,null,null,null,null,null,null,null,null,null,{"$f":"CONCATENATE(\"n° stalli (S₃) = \",FIXED(Q23),\"/(2,50x5,00) =\")","v":"n° stalli (S₃) = 787.50/(2,50x5,00) ="},{"$f":"Q23/(2.5*5)","v":63}]
[null,null,null,null,null,null,null,null,null,null,null,null,null,null,null,null,{"$f":"CONCATENATE(\"n° stalli (ar.41sexies) = \",FIXED(Q35),\"/(2,50x5,00) =\")","v":"n° stalli (ar.41sexies) = 3,150.00/(2,50x5,00) ="},{"$f":"Q35/(2.5*5)","v":252}]
[]
[]
[null,null,null,null,null,null,null,null,{"$f":"CONCATENATE( \"n° piani = \",FIXED(I84,0), \" → H₁ = \")","v":"n° piani = 3 → H₁ = "},{"$f":"2.7+(I84-1)*3","v":8.6999999999999993},"m",null,null,null,null,{"$f":"CONCATENATE(\"SAL₁ = Vreep / H₁ = \",FIXED(Q11),\"/\",FIXED(J41),\" = \")","v":"SAL₁ = Vreep / H₁ = 8,820.00/8.70 = "},{"$f":"Q11/J41","v":1013.7931034482759},"m²",null,null,null,null,"1. Case in Linea"]
[]
[null,null,null,null,null,null,null,null,{"$f":"CONCATENATE( \"n° piani = \",FIXED(I85,0), \" → H₂ = \")","v":"n° piani = 2 → H₂ = "},{"$f":"2.7+(I85-1)*3","v":5.7},"m",null,null,null,null,{"$f":"CONCATENATE(\"SC₂  = (Vreep∙\",FIXED(I82),\"%) / H₂ = \",FIXED(Q13),\"x\",FIXED(I82),\"%)/\",FIXED(J43),\" = \")","v":"SC₂  = (Vreep∙43.00%) / H₂ = 13,230.00x43.00%)/5.70 = "},{"$f":"Q13*I82*10^-2/J43","v":998.0526315789474},"m²",null,null,null,null,"2. Case a schiera"]
[]
[null,null,null,"Superfici coperte",null,null,null,null,{"$f":"CONCATENATE( \"n° piani = \",FIXED(I87,0), \" → H₃ = \")","v":"n° piani = 1 → H₃ = "},{"$f":"2.7+(I86-1)*3","v":-0.29999999999999982},"m",null,null,null,null,{"$f":"CONCATENATE(\"SC₃  = (Vreep∙\",FIXED(I84),\"%) / H₃ = \",FIXED(Q13),\"x\",FIXED(I84),\"%)/\",FIXED(J45),\" = \")","v":"SC₃  = (Vreep∙3.00%) / H₃ = 13,230.00x3.00%)/-0.30 = "},{"$f":"Q13*I83*10^-2/J45","v":-25137.000000000015},"m²",null,null,null,null,"3. Case Unifamiliari isolate"]
[]
[null,null,null,null,null,null,null,null,{"$f":"CONCATENATE( \"n° piani = \",FIXED(I88,0), \" → H₄ = \")","v":"n° piani = 4 → H₄ = "},11.5,"m",null,null,null,null,{"$f":"CONCATENATE(\"SC₄  = VS / H₄  = \",FIXED(K15),\"/\",FIXED(J47),\" = \")","v":"SC₄  = VS / H₄  = 6,300.00/11.50 = "},{"$f":"K15/J47","v":547.82608695652175},"m²",null,null,null,null,"4. Edifici non residenziali connessi con la residenza( negozi, bar, studi)   "]
[]
[null,null,null,null,null,null,null,null,{"$f":"CONCATENATE( \"n° piani = \",FIXED(I89,0), \" → H₅ = \")","v":"n° piani = 1 → H₅ = "},4,"m",null,null,null,null,{"$f":"CONCATENATE(\"SC₅  = VS / H₅  = \",FIXED(K18),\"/\",FIXED(J49),\" = \")","v":"SC₅  = VS / H₅  = 3,150.00/4.00 = "},{"$f":"K18/J49","v":787.5},"m²",null,null,null,null,"5. Edifici  pubblici"]
[]
[]
[]
[null,null,null,"Legenda"]
[]
[null,null,"it - ","indice territoriale "]
[null,null,"A -","Superficie Area da Lottizzare "]
[null,null,"V -","Volumetria realizzabile"]
[null,null,"VR -","Volumetria per residenza"]
[null,null,"VReep -","Volumetria per l' edilizia economica e popolare"]
[null,null,"VRlib -","Volumetria edilizia residenziale non vincolata"]
[null,null,"VS -","Volumetria per servizi connessi con la residenza(negozi, bar, studi)   "]
[null,null,"VSp -","Volumetria per servizi pubblici;"]
[null,null,"n,ab ","Numero abitanti insidiabili "]
[null,null,"S1 -","Aree per l’istruzione asili nido, scuole materne e scuole dell’obbligo;"]
[null,null,"S2 -","Aree per attrezzature di interesse comune religiose, culturali, sociali, assistenziali, "]
[null,null,null,"sanitarie, amministrative, per pubblici servizi (uffici PT. protezione civile, ecc.) ed altre; ",null,null,null,null,null,null,null,null,null,null,null,null,null,null,null,null,0.4]
[null,null,"S3 -","Aree per spazi pubblici attrezzati a parco e per il gioco e lo sport effettivamente utilizzabili per tali impianti ",null,null,null,null,null,null,null,null,null,null,null,null,null,null,null,null,0.45]
[null,null,null,"con esclusione d fasce verdi lungo le strade",null,null,null,null,null,null,null,null,null,null,null,null,null,null,null,null,0.5]
[null,null,"S4 -","Aree per parcheggi pubblici. in aggiunta alla superficie a parcheggio prevista daIl’Art. 41 sexies Legge 17/08/42, n. 1150) ",null,null,null,null,null,null,null,null,null,null,null,null,null,null,null,null,0.55000000000000004]
[null,null,null,"tali aree, in casi speciali, potranno essere distribuite su diversi livelli: ",null,null,null,null,null,null,null,null,null,null,null,null,null,null,null,null,0.6]
[null,null,"Sp -","(Art. 41 sexies Legge 17/08/42, n. 1150) Nelle nuove costruzioni ed anche nelle aree di pertinenza delle costruzioni stesse, ",null,null,null,null,null,null,null,null,null,null,null,null,null,null,null,null,0.65]
[null,null,null,"debbono essere riservati appositi spazi per parcheggi in misura non inferiore ad un metro quadrato per ogni dieci metri cubi di costruzione.",null,null,null,null,null,null,null,null,null,null,null,null,null,null,null,null,0.7]
[]
[null,null,null,null,null,null,null,null,"m²/ab","S1","S2","S3","S4"]
[null,null,1,"Classe I - Comuni con oltre 20.000 abitanti;",null,null,null,null,18,4.5,2,9,2.5]
[null,null,2,"Classe II - Comuni da 10.000 a 20.000 abitanti;",null,null,null,null,18,4.5,2,9,2.5]
[null,null,3,"Classe III - Comuni da 2.000 a 10.000 abitanti;",null,null,null,null,12,4,2,5,1]
[null,null,4,"Classe IV - Comuni sino a 2.000 abitanti",null,null,null,null,12,4,2,5,1]
[null,null,null,2,null,null,null,null,{"$f":"IF(OR(D79=1,D79=2),I75,I77)","v":18},{"$f":"IF(OR(D79=1,D79=2),J75,J77)","v":4.5},{"$f":"IF(OR(D79=1,D79=2),K75,K77)","v":2},{"$f":"IF(OR(D79=1,D79=2),L75,L77)","v":9},{"$f":"IF(OR(D79=1,D79=2),M75,M77)","v":2.5},{"$f":"LOOKUP(D79,C75:C78,D75:D78)","v":"Classe II - Comuni da 10.000 a 20.000 abitanti;"}]
[]
[null,null,null,null,null,null,null,"% sup. viabilità",15]
[null,null,null,null,null,null,null,"% vr2",43]
[null,null,null,null,null,null,null,"% Vr3",{"$f":"100-I82","v":57}]
[null,null,null,null,null,null,null,"tip.01",3]
[null,null,null,null,null,null,null,"tip.02",2]
[null,null,null,null,null,null,null,"tip.03",0]
[null,null,null,null,null,null,null,"tip.04",1]
[null,null,null,null,null,null,null,"tip.05",4]
[null,null,null,null,null,null,null,"tip.06",1]

{"sheet":"Volumi","index":1,"n_rows":47,"n_cols":14,"rows_kept":47,"cut":false,"hidden":false,"merged":[[1,1,2,1],[1,2,2,2],[1,0,2,0]]}
[null,"Dimostrazione Piano di Lottizzazione"]
["N°","Tipologia","Lotto","Sf","Sc","Hv","Vr","Vs₁","Vs₂","if=V/Sf","VR tip. 01","VR tip. 02","VR tip. 03","VR tip. 04"]
[null,null,null,"m²","m²","m","m³","m³","m³","m³/m²","m³","m³","m³","m³"]
["001","R₁",{"$f":"IF(B4=\"\",\"\",CONCATENATE(B4,\" - \",A4))","v":"R₁ - 001"},600,120,5.7,{"$f":"IF(B4=\"\",\"\",IF(LEFT(B4,1)=\"R\",E4*F4,\"\"))","v":684},{"$f":"IF(LEFT(B4,2)=A46,D4*E4,\"\")","v":""},{"$f":"IF(LEFT(B4,1)=\"S\",E4*F4,\"\")","v":""},{"$f":"IF(LEFT(B4,1)=\"R\",G4/D4,IF(LEFT(B4,1)=\"S\",I4/D4,\"\"))","v":1.1399999999999999},{"$f":"IF(LEFT(B4,2)=$A$42,G4,\"\")","v":684},{"$f":"IF(LEFT(B4,2)=$A$43,G4,\"\")","v":""},{"$f":"IF(LEFT(B4,2)=$A$44,G4,\"\")","v":""},{"$f":"IF(LEFT(B4,2)=$A$45,G4,\"\")","v":""}]
["002","R₁",{"$f":"IF(B5=\"\",\"\",CONCATENATE(B5,\" - \",A5))","v":"R₁ - 002"},500,100,5.7,{"$f":"IF(B5=\"\",\"\",IF(LEFT(B5,1)=\"R\",E5*F5,\"\"))","v":570},{"$f":"IF(LEFT(A5,1)=\"S\",D5*E5,\"\")","v":""},"",{"$f":"IF(LEFT(B5,1)=\"R\",G5/D5,IF(LEFT(B5,1)=\"S\",I5/D5,\"\"))","v":1.1399999999999999},{"$f":"IF(LEFT(B5,2)=$A$42,G5,\"\")","v":570},{"$f":"IF(LEFT(B5,2)=$A$43,G5,\"\")","v":""},{"$f":"IF(LEFT(B5,2)=$A$44,G5,\"\")","v":""}]
["003",null,null,null,null,null,"","","","","","",""]
["004",null,null,null,null,null,"","","","","","",""]
["005",null,null,null,null,null,"","","","","","",""]
["006",null,null,null,null,null,"","","","","","",""]
["007",null,null,null,null,null,"","","","","","",""]
["008",null,null,null,null,null,"","","","","","",""]
["009",null,null,null,null,null,"","","","","","",""]
["010",null,null,null,null,null,"","","","","","",""]
["011",null,null,null,null,null,"","","","","","",""]
["012",null,null,null,null,null,"","","","","","",""]
["013",null,null,null,null,null,"","","","","","",""]
["014",null,null,null,null,null,"","","","","","",""]
["015",null,null,null,null,null,"","","","","","",""]
["016",null,null,null,null,null,"","","","","","",""]
["017",null,null,null,null,null,null,null,"",null,null,null,""]
["018",null,null,null,null,null,null,null,"","","","",""]
["019",null,"",null,null,null,"","","","","","",""]
["020",null,"",null,null,null,"","","","","","",""]
["021",null,"",null,null,null,"","","","","","",""]
["022",null,"",null,null,null,"","","","","","",""]
["023",null,"",null,null,null,"","","","","","",""]
["024",null,"",null,null,null,"","","","","","",""]
["025",null,"",null,null,null,"","","","","","",""]
["026",null,"",null,null,null,"","","","","","",""]
["027",null,"",null,null,null,"","","","","","",""]
["028",null,"",null,null,null,"","","","","","",""]
["029",null,"",null,null,null,"","","","","","",""]
["030",null,"",null,null,null,"","","","","","",""]
["031",null,"",null,null,null,"","","","","","",""]
["032",null,"",null,null,null,"","","","","","",""]
[null,null,null,null,null,null,{"$f":"SUM(G4:G35)","v":1254},{"$f":"SUM(H4:H35)","v":0},{"$f":"SUM(I4:I35)","v":0},null,{"$f":"SUM(K4:K35)","v":1254},0,0,0]
[]
[null,{"$f":"IF(G36>Standard!K12,CONCATENATE(\"Totale Volume Residenziale in progetto → VR = \",FIXED(G36),\" m³ > Volume Residensiale Standard = \",FIXED(Standard!K12),\"m³\"),CONCATENATE(\"Totale Volume Residenziale in progetto → VR = \",FIXED(G36),\" m³ < Volume Residensiale Standard = \",FIXED(Standard!K12),\"m³\" ))","v":"Totale Volume Residenziale in progetto → VR = 1,254.00 m³ < Volume Residensiale Standard = 22,050.00m³"}]
[null,{"$f":"IF(H36+I36<Standard!K18,CONCATENATE(\"Totale Volume  Servizi Pubblici in progetto → Vsp=Vs1+Vs2= \",FIXED(H36),\"+\",FIXED(I36),\" = \",FIXED(H36+I36),\"m³ < Volume  Servizi Pubblici Standard = \",FIXED(Standard!K18),\"m³\"),CONCATENATE(\"Totale Volume  Servizi Pubblici in progetto → Vsp=Vs1+Vs2 = \",FIXED(H36),\"+\",FIXED(I36),\" = \",FIXED(H36+I36),\"m³ > Volume  Servizi Pubblici Standard = \",FIXED(Standard!K18),\"m³\"))","v":"Totale Volume  Servizi Pubblici in progetto → Vsp=Vs1+Vs2= 0.00+0.00 = 0.00m³ < Volume  Servizi Pubblici Standard = 3,150.00m³"}]
[null,{"$f":"IF(G36<Standard!K12,CONCATENATE(\"Totale Volume Servizi alla Residenza in progetto → VR = \",FIXED(N36),\" m³ < Volume Servizi alla Residenza Standard = \",FIXED(Standard!K15),\"m³\"),CONCATENATE(\"Totale Volume Residenziale in progetto → VR = \",FIXED(N36),\" m³ > Volume Residensiale Standard = \",FIXED(Standard!K15),\"m³\" ))","v":"Totale Volume Servizi alla Residenza in progetto → VR = 0.00 m³ < Volume Servizi alla Residenza Standard = 6,300.00m³"}]
[]
["R₁","edilizia economica e popolare"]
["R₂","edifici a schiera"]
["R₃","edifici unifamuliari isolati"]
["R₄","edifici connessi alla residenza (negozi, bar, studi etc….)"]
["S₁","edifici per l’istruzione (asili nido, scuole materne e scuole dell’obbligo)"]
["S₂","edifici d' interesse comune (edifici di culto, ambulatori, uffici PT. protezione civile, ecc.)"]

{"sheet":"Superfici","index":2,"n_rows":51,"n_cols":13,"rows_kept":51,"cut":false,"hidden":false,"merged":[[1,0,2,0],[1,1,2,1],[1,2,2,2]]}
[null,"Dimostrazione Piano di Lottizzazione"]
["N°","Tipologia","Lotto","Area","L₁","L₂","L₃","L₄","S₁p","S₂p","S₃p","S₄p","S₅p"]
[null,null,null,"m²","m²","m²","m²","m²","m³/m²","m³","m³","m³","m³"]
["001","L₁",{"$f":"IF(B4=\"\",\"\",CONCATENATE(B4,\" - \",A4))","v":"L₁ - 001"},600,{"$f":"IF(B4=\"\",\"\",IF(LEFT(B4,2)=$A$43,D4,\"\"))","v":600},{"$f":"IF(B4=\"\",\"\",IF(LEFT(B4,2)=$A$44,D4,\"\"))","v":""},{"$f":"IF(B4=\"\",\"\",IF(LEFT(B4,2)=$A$45,D4,\"\"))","v":""},{"$f":"IF(B4=\"\",\"\",IF(LEFT(B4,2)=$A$46,D4,\"\"))","v":""},{"$f":"IF(B4=\"\",\"\",IF(LEFT(B4,2)=$A$47,D4,\"\"))","v":""},{"$f":"IF(B4=\"\",\"\",IF(LEFT(B4,2)=$A$48,D4,\"\"))","v":""},{"$f":"IF(B4=\"\",\"\",IF(LEFT(B4,2)=$A$49,D4,\"\"))","v":""},{"$f":"IF(B4=\"\",\"\",IF(LEFT(B4,2)=$A$50,D4,\"\"))","v":""},{"$f":"IF(B4=\"\",\"\",IF(LEFT(B4,2)=$A$51,D4,\"\"))","v":""}]
["002","S₁",{"$f":"IF(B5=\"\",\"\",CONCATENATE(B5,\" - \",A5))","v":"S₁ - 002"},500,{"$f":"IF(B5=\"\",\"\",IF(LEFT(B5,2)=$A$43,D5,\"\"))","v":""},{"$f":"IF(B5=\"\",\"\",IF(LEFT(B5,2)=$A$44,D5,\"\"))","v":""},{"$f":"IF(B5=\"\",\"\",IF(LEFT(B5,2)=$A$45,D5,\"\"))","v":""},{"$f":"IF(B5=\"\",\"\",IF(LEFT(B5,2)=$A$46,D5,\"\"))","v":""},{"$f":"IF(B5=\"\",\"\",IF(LEFT(B5,2)=$A$47,D5,\"\"))","v":500},{"$f":"IF(B5=\"\",\"\",IF(LEFT(B5,2)=$A$48,D5,\"\"))","v":""},{"$f":"IF(LEFT(B5,2)=$A$44,G5,\"\")","v":""},{"$f":"IF(LEFT(B5,2)=$A$45,G5,\"\")","v":""},{"$f":"IF(B4=\"\",\"\",IF(LEFT(B4,2)=$A$48,D4,\"\"))","v":""}]
["003","S₂","S₂ - 003",200,"","","","","",200,"",""]
["004","L₃","L₃ - 004",450,"","",450,"","","","",450]
["005","L₃","L₃ - 005",600,"","",600,"","","","",600]
["006",null,"",null,"","","","","","","",""]
["007",null,"",null,"","","","","","","",""]
["008",null,"",null,"","","","","","","",""]
["009",null,"",null,"","","","","","","",""]
["010",null,"",null,"","","","","","","",""]
["011",null,"",null,"","","","","","","",""]
["012",null,"",null,"","","","","","","",""]
["013",null,"",null,"","","","","","","",""]
["014",null,"",null,"","","","","","","",""]
["015",null,"",null,"","","","","","","",""]
["016",null,"",null,"","","","","","","",""]
["017",null,"",null,"","","","","","",null,""]
["018",null,"",null,"","","","","","",{"$f":"IF(LEFT(B21,2)=$A$44,G21,\"\")","v":""},""]
["019",null,"",null,"","","","","","","",""]
["020",null,"",null,"","","","","","","",""]
["021",null,"",null,"","","","","","","",""]
["022",null,"",null,"","","","","","","",""]
["023",null,"",null,"","","","","","","",""]
["024",null,"",null,"","","","","","","",""]
["025",null,"",null,"","","","","","","",""]
["026",null,"",null,"","","","","","","",""]
["027",null,"",null,"","","","","","","",""]
["028",null,"",null,"","","","","","","",""]
["029",null,"",null,"","","","","","","",""]
["030",null,"",null,"","","","","","","",""]
["031",null,"",null,"","","","","","","",""]
["032",null,"",null,"","","","","","","",""]
[null,null,null,null,{"$f":"SUM(E4:E35)","v":600},0,1050,0,500,200,{"$f":"SUM(K4:K35)","v":0},1050,0]
[]
[null,{"$f":"IF(I36>Standard!Q20,CONCATENATE(\"Totale Area Servizi progetto → S₁p = \",FIXED(I36),\" m² > Area Servizi  standard S₁s =  \",FIXED(Standard!Q20),\" m²\"),CONCATENATE(\"Totale Area Servizi progetto → S₁p = \",FIXED(I36),\" m² <  Area Servizi standard S₁s =  \",FIXED(Standard!Q20),\" m²\"))","v":"Totale Area Servizi progetto → S₁p = 500.00 m² <  Area Servizi standard S₁s =  1,417.50 m²"}]
[null,{"$f":"IF(J36>Standard!Q21,CONCATENATE(\"Totale Area Servizi progetto → S₂p = \",FIXED(J36),\" m² > Area Servizi  standard S₂s =  \",FIXED(Standard!Q21),\" m²\"),CONCATENATE(\"Totale Area Servizi progetto → S₂p = \",FIXED(J36),\" m² <  Area Servizi  standard S₂s =  \",FIXED(Standard!Q21),\" m²\"))","v":"Totale Area Servizi progetto → S₂p = 200.00 m² <  Area Servizi  standard S₂s =  630.00 m²"}]
[null,{"$f":"IF(K36>Standard!Q22,CONCATENATE(\"Totale Area Servizi progetto → S₃p = \",FIXED(K36),\" m² > Area Servizi standard S₃s =  \",FIXED(Standard!Q22),\" m²\"),CONCATENATE(\"Totale Area Servizi progetto → S₃p = \",FIXED(K36),\" m² <  Area Servizi  standard S₃s =  \",FIXED(Standard!Q22),\" m²\"))","v":"Totale Area Servizi progetto → S₃p = 0.00 m² <  Area Servizi  standard S₃s =  2,835.00 m²"}]
[null,{"$f":"IF(L36>Standard!Q24,CONCATENATE(\"Totale Area Servizi progetto → S₄p = \",FIXED(L36),\" m² > Area Servizi standard S₄s =  \",FIXED(Standard!Q23),\" m²\"),CONCATENATE(\"Totale Area Servizi progetto → S₄p = \",FIXED(L36),\" m² <  Area Servizi  standard S₄s =  \",FIXED(Standard!Q24),\" m²\"))","v":"Totale Area Servizi progetto → S₄p = 1,050.00 m² > Area Servizi standard S₄s =  787.50 m²"}]
[]
["L₁","edilizia economica e popolare"]
["L₂","edifici a schiera"]
["L₃","edifici unifamuliari isolati"]
["L₄","edifici connessi alla residenza (negozi, bar, studi etc….)"]
["S₁","edifici per l’istruzione (asili nido, scuole materne e scuole dell’obbligo)"]
["S₂","edifici d' interesse comune (edifici di culto, ambulatori, uffici PT. protezione civile, ecc.)"]
["S₃","Aree per spazi pubblici attrezzati a parco e per il gioco e lo sport effettivamente utilizzabili per tali impianti "]
["S₄","Aree per parcheggi pubblici"]
["S₅","Area per viabilità"]